{"text_format":"1","workbook":"xlsx","n_sheets":5,"sheets":["Guidance","Sheet1","Sheet3","Project Programme Template","Sheet2"],"not_rendered":{"charts":0,"images":1,"macros":1,"external_links":0,"defined_names":0,"comments":1,"pivot_tables":0},"unopened":[],"bounds":{"document_bytes":16777216,"sheet_cells":100000,"rows_first":2000,"rows_last":500,"rows_between":2000,"halvings":0,"cell_chars":16384,"cell_head_chars":4096},"cells_cut":0,"cells_raw":0,"read":"whole","date_system":"1900"}

{"sheet":"Guidance","index":0,"n_rows":6,"n_cols":6,"rows_kept":6,"cut":false,"hidden":false,"merged":[]}
[]
[]
[]
[]
[]
[null,null,null,null,null,"Guidance "]

{"sheet":"Sheet1","index":1,"n_rows":11,"n_cols":8,"rows_kept":11,"cut":false,"hidden":true,"merged":[]}
[]
[]
[]
[]
[]
[]
[]
[null,null,null,null,null,"Q1 ","January 1 ","1931-03-01"]
[null,null,null,null,null,"Q2"," April 1"," June 30"]
[null,null,null,null,null,"Q3","July 1 ","1930-09-01"]
[null,null,null,null,null,"Q4","2024-10-01"," December 31"]

{"sheet":"Sheet3","index":2,"n_rows":157,"n_cols":1,"rows_kept":157,"cut":false,"hidden":true,"merged":[]}
["Column1"]
["2024-03-06"]
["2024-03-13"]
["2024-03-20"]
["2024-03-27"]
["2024-04-03"]
["2024-04-10"]
["2024-04-17"]
["2024-04-24"]
["2024-05-01"]
["2024-05-08"]
["2024-05-15"]
["2024-05-22"]
["2024-05-29"]
["2024-06-05"]
["2024-06-12"]
["2024-06-19"]
["2024-06-26"]
["2024-07-03"]
["2024-07-10"]
["2024-07-17"]
["2024-07-24"]
["2024-07-31"]
["2024-08-07"]
["2024-08-14"]
["2024-08-21"]
["2024-08-28"]
["2024-09-04"]
["2024-09-11"]
["2024-09-18"]
["2024-09-25"]
["2024-10-02"]
["2024-10-09"]
["2024-10-16"]
["2024-10-23"]
["2024-10-30"]
["2024-11-06"]
["2024-11-13"]
["2024-11-20"]
["2024-11-27"]
["2024-12-04"]
["2024-12-11"]
["2024-12-18"]
["2024-12-25"]
["2025-01-01"]
["2025-01-08"]
["2025-01-15"]
["2025-01-22"]
["2025-01-29"]
["2025-02-05"]
["2025-02-12"]
["2025-02-19"]
["2025-02-26"]
["2025-03-05"]
["2025-03-12"]
["2025-03-19"]
["2025-03-26"]
["2025-04-02"]
["2025-04-09"]
["2025-04-16"]
["2025-04-23"]
["2025-04-30"]
["2025-05-07"]
["2025-05-14"]
["2025-05-21"]
["2025-05-28"]
["2025-06-04"]
["2025-06-11"]
["2025-06-18"]
["2025-06-25"]
["2025-07-02"]
["2025-07-09"]
["2025-07-16"]
["2025-07-23"]
["2025-07-30"]
["2025-08-06"]
["2025-08-13"]
["2025-08-20"]
["2025-08-27"]
["2025-09-03"]
["2025-09-10"]
["2025-09-17"]
["2025-09-24"]
["2025-10-01"]
["2025-10-08"]
["2025-10-15"]
["2025-10-22"]
["2025-10-29"]
["2025-11-05"]
["2025-11-12"]
["2025-11-19"]
["2025-11-26"]
["2025-12-03"]
["2025-12-10"]
["2025-12-17"]
["2025-12-24"]
["2025-12-31"]
["2026-01-07"]
["2026-01-14"]
["2026-01-21"]
["2026-01-28"]
["2026-02-04"]
["2026-02-11"]
["2026-02-18"]
["2026-02-25"]
["2026-03-04"]
["2026-03-11"]
["2026-03-18"]
["2026-03-25"]
["2026-04-01"]
["2026-04-08"]
["2026-04-15"]
["2026-04-22"]
["2026-04-29"]
["2026-05-06"]
["2026-05-13"]
["2026-05-20"]
["2026-05-27"]
["2026-06-03"]
["2026-06-10"]
["2026-06-17"]
["2026-06-24"]
["2026-07-01"]
["2026-07-08"]
["2026-07-15"]
["2026-07-22"]
["2026-07-29"]
["2026-08-05"]
["2026-08-12"]
["2026-08-19"]
["2026-08-26"]
["2026-09-02"]
["2026-09-09"]
["2026-09-16"]
["2026-09-23"]
["2026-09-30"]
["2026-10-07"]
["2026-10-14"]
["2026-10-21"]
["2026-10-28"]
["2026-11-04"]
["2026-11-11"]
["2026-11-18"]
["2026-11-25"]
["2026-12-02"]
["2026-12-09"]
["2026-12-16"]
["2026-12-23"]
["2026-12-30"]
["2027-01-06"]
["2027-01-13"]
["2027-01-20"]
["2027-01-27"]
["2027-02-03"]
["2027-02-10"]
["2027-02-17"]
["2027-02-24"]

{"sheet":"Project Programme Template","index":3,"n_rows":94,"n_cols":164,"rows_kept":94,"cut":false,"hidden":false,"merged":[[5,7,5,10],[5,4,5,5]]}
[88]
[]
[]
[null,null,null,"Salix Phase 4 PSDS PROJECT PROGRAMME TEMPLATE"]
[]
[null,null,null,"APPLICANT  NAME",null,null,"SITE NAME",null,null,null,null,null,null,null,null,null,null,"Yes"]
[]
[null,null,null,"PROJECT ID",null,null,"PROJECT END DATE"]
[]
[null,null,null,"HOW LONG IS THE PROJECT?","1 Year",null,"NUMBER OF SITES",2]
[]
[null,null,null,"PROJECT START DATE?"]
[]
[null,null,null,"TODAY'S DATE"]
[null,null,null,null,null,null,null,null,{"$f":"TEXT(I16,\"mmm\")","v":"Mar"},{"$f":"IF(MONTH(J16)=MONTH(I16),\"\",TEXT(J16,\"mmmm\"))","v":""},{"$f":"IF(MONTH(K16)=MONTH(J16),\"\",TEXT(K16,\"mmm\"))","v":""},{"$f":"IF(MONTH(L16)=MONTH(K16),\"\",TEXT(L16,\"mmm\"))","v":""},{"$f":"IF(MONTH(M16)=MONTH(L16),\"\",TEXT(M16,\"mmm \"))","v":""},{"$f":"IF(MONTH(N16)=MONTH(M16),\"\",TEXT(N16,\"mmm\"))","v":"Apr"},{"$f":"IF(MONTH(O16)=MONTH(N16),\"\",TEXT(O16,\"mmm\"))","v":""},{"$f":"IF(MONTH(P16)=MONTH(O16),\"\",TEXT(P16,\"mmm\"))","v":""},{"$f":"IF(MONTH(Q16)=MONTH(P16),\"\",TEXT(Q16,\"mmm\"))","v":""},{"$f":"IF(MONTH(R16)=MONTH(Q16),\"\",TEXT(R16,\"mmm\"))","v":"May"},{"$f":"IF(MONTH(S16)=MONTH(R16),\"\",TEXT(S16,\"mmm\"))","v":""},{"$f":"IF(MONTH(T16)=MONTH(S16),\"\",TEXT(T16,\"mmm\"))","v":""},{"$f":"IF(MONTH(U16)=MONTH(T16),\"\",TEXT(U16,\"mmm\"))","v":""},{"$f":"IF(MONTH(V16)=MONTH(U16),\"\",TEXT(V16,\"mmm\"))","v":"Jun"},{"$f":"IF(MONTH(W16)=MONTH(V16),\"\",TEXT(W16,\"mmm\"))","v":""},{"$f":"IF(MONTH(X16)=MONTH(W16),\"\",TEXT(X16,\"mmm\"))","v":""},{"$f":"IF(MONTH(Y16)=MONTH(X16),\"\",TEXT(Y16,\"mmm\"))","v":""},{"$f":"IF(MONTH(Z16)=MONTH(Y16),\"\",TEXT(Z16,\"mmm\"))","v":""},{"$f":"IF(MONTH(AA16)=MONTH(Z16),\"\",TEXT(AA16,\"mmm\"))","v":"Jul"},{"$f":"IF(MONTH(AB16)=MONTH(AA16),\"\",TEXT(AB16,\"mmm\"))","v":""},{"$f":"IF(MONTH(AC16)=MONTH(AB16),\"\",TEXT(AC16,\"mmm\"))","v":""},{"$f":"IF(MONTH(AD16)=MONTH(AC16),\"\",TEXT(AD16,\"mmm\"))","v":""},{"$f":"IF(MONTH(AE16)=MONTH(AD16),\"\",TEXT(AE16,\"mmm\"))","v":"Aug"},{"$f":"IF(MONTH(AF16)=MONTH(AE16),\"\",TEXT(AF16,\"mmm\"))","v":""},{"$f":"IF(MONTH(AG16)=MONTH(AF16),\"\",TEXT(AG16,\"mmm\"))","v":""},{"$f":"IF(MONTH(AH16)=MONTH(AG16),\"\",TEXT(AH16,\"mmm\"))","v":""},{"$f":"IF(MONTH(AI16)=MONTH(AH16),\"\",TEXT(AI16,\"mmm\"))","v":""},{"$f":"IF(MONTH(AJ16)=MONTH(AI16),\"\",TEXT(AJ16,\"mmm\"))","v":"Sep"},{"$f":"IF(MONTH(AK16)=MONTH(AJ16),\"\",TEXT(AK16,\"mmm\"))","v":""},{"$f":"IF(MONTH(AL16)=MONTH(AK16),\"\",TEXT(AL16,\"mmm\"))","v":""},{"$f":"IF(MONTH(AM16)=MONTH(AL16),\"\",TEXT(AM16,\"mmm\"))","v":""},{"$f":"IF(MONTH(AN16)=MONTH(AM16),\"\",TEXT(AN16,\"mmm\"))","v":"Oct"},{"$f":"IF(MONTH(AO16)=MONTH(AN16),\"\",TEXT(AO16,\"mmm\"))","v":""},{"$f":"IF(MONTH(AP16)=MONTH(AO16),\"\",TEXT(AP16,\"mmm\"))","v":""},{"$f":"IF(MONTH(AQ16)=MONTH(AP16),\"\",TEXT(AQ16,\"mmm\"))","v":""},{"$f":"IF(MONTH(AR16)=MONTH(AQ16),\"\",TEXT(AR16,\"mmm\"))","v":"Nov"},{"$f":"IF(MONTH(AS16)=MONTH(AR16),\"\",TEXT(AS16,\"mmm\"))","v":""},{"$f":"IF(MONTH(AT16)=MONTH(AS16),\"\",TEXT(AT16,\"mmm\"))","v":""},{"$f":"IF(MONTH(AU16)=MONTH(AT16),\"\",TEXT(AU16,\"mmm\"))","v":""},{"$f":"IF(MONTH(AV16)=MONTH(AU16),\"\",TEXT(AV16,\"mmm\"))","v":""},{"$f":"IF(MONTH(AW16)=MONTH(AV16),\"\",TEXT(AW16,\"mmm\"))","v":"Dec"},{"$f":"IF(MONTH(AX16)=MONTH(AW16),\"\",TEXT(AX16,\"mmm\"))","v":""},{"$f":"IF(MONTH(AY16)=MONTH(AX16),\"\",TEXT(AY16,\"mmm\"))","v":""},{"$f":"IF(MONTH(AZ16)=MONTH(AY16),\"\",TEXT(AZ16,\"mmm\"))","v":""},{"$f":"IF(MONTH(BA16)=MONTH(AZ16),\"\",TEXT(BA16,\"mmm\"))","v":"Jan"},{"$f":"IF(MONTH(BB16)=MONTH(BA16),\"\",TEXT(BB16,\"mmm\"))","v":""},{"$f":"IF(MONTH(BC16)=MONTH(BB16),\"\",TEXT(BC16,\"mmm\"))","v":""},{"$f":"IF(MONTH(BD16)=MONTH(BC16),\"\",TEXT(BD16,\"mmm\"))","v":""},{"$f":"IF(MONTH(BE16)=MONTH(BD16),\"\",TEXT(BE16,\"mmm\"))","v":"Feb"},{"$f":"IF(MONTH(BF16)=MONTH(BE16),\"\",TEXT(BF16,\"mmm\"))","v":""},{"$f":"IF(MONTH(BG16)=MONTH(BF16),\"\",TEXT(BG16,\"mmm\"))","v":""},{"$f":"IF(MONTH(BH16)=MONTH(BG16),\"\",TEXT(BH16,\"mmm\"))","v":""},{"$f":"IF(MONTH(BI16)=MONTH(BH16),\"\",TEXT(BI16,\"mmm\"))","v":"Mar"},{"$f":"IF(MONTH(BJ16)=MONTH(BI16),\"\",TEXT(BJ16,\"mmm\"))","v":""},{"$f":"IF(MONTH(BK16)=MONTH(BJ16),\"\",TEXT(BK16,\"mmm\"))","v":""},{"$f":"IF(MONTH(BL16)=MONTH(BK16),\"\",TEXT(BL16,\"mmm\"))","v":""},{"$f":"IF(MONTH(BM16)=MONTH(BL16),\"\",TEXT(BM16,\"mmm\"))","v":""},{"$f":"IF(MONTH(BN16)=MONTH(BM16),\"\",TEXT(BN16,\"mmm\"))","v":"Apr"},{"$f":"IF(MONTH(BO16)=MONTH(BN16),\"\",TEXT(BO16,\"mmm\"))","v":""},{"$f":"IF(MONTH(BP16)=MONTH(BO16),\"\",TEXT(BP16,\"mmm\"))","v":""},{"$f":"IF(MONTH(BQ16)=MONTH(BP16),\"\",TEXT(BQ16,\"mmm\"))","v":""},{"$f":"IF(MONTH(BR16)=MONTH(BQ16),\"\",TEXT(BR16,\"mmm\"))","v":"May"},{"$f":"IF(MONTH(BS16)=MONTH(BR16),\"\",TEXT(BS16,\"mmm\"))","v":""},{"$f":"IF(MONTH(BT16)=MONTH(BS16),\"\",TEXT(BT16,\"mmm\"))","v":""},{"$f":"IF(MONTH(BU16)=MONTH(BT16),\"\",TEXT(BU16,\"mmm\"))","v":""},{"$f":"IF(MONTH(BV16)=MONTH(BU16),\"\",TEXT(BV16,\"mmm\"))","v":""},{"$f":"IF(MONTH(BW16)=MONTH(BV16),\"\",TEXT(BW16,\"mmm\"))","v":"Jun"},{"$f":"IF(MONTH(BX16)=MONTH(BW16),\"\",TEXT(BX16,\"mmm\"))","v":""},{"$f":"IF(MONTH(BY16)=MONTH(BX16),\"\",TEXT(BY16,\"mmm\"))","v":""},{"$f":"IF(MONTH(BZ16)=MONTH(BY16),\"\",TEXT(BZ16,\"mmm\"))","v":""},{"$f":"IF(MONTH(CA16)=MONTH(BZ16),\"\",TEXT(CA16,\"mmm\"))","v":"Jul"},{"$f":"IF(MONTH(CB16)=MONTH(CA16),\"\",TEXT(CB16,\"mmm\"))","v":""},{"$f":"IF(MONTH(CC16)=MONTH(CB16),\"\",TEXT(CC16,\"mmm\"))","v":""},{"$f":"IF(MONTH(CD16)=MONTH(CC16),\"\",TEXT(CD16,\"mmm\"))","v":""},{"$f":"IF(MONTH(CE16)=MONTH(CD16),\"\",TEXT(CE16,\"mmm\"))","v":"Aug"},{"$f":"IF(MONTH(CF16)=MONTH(CE16),\"\",TEXT(CF16,\"mmm\"))","v":""},{"$f":"IF(MONTH(CG16)=MONTH(CF16),\"\",TEXT(CG16,\"mmm\"))","v":""},{"$f":"IF(MONTH(CH16)=MONTH(CG16),\"\",TEXT(CH16,\"mmm\"))","v":""},{"$f":"IF(MONTH(CI16)=MONTH(CH16),\"\",TEXT(CI16,\"mmm\"))","v":""},{"$f":"IF(MONTH(CJ16)=MONTH(CI16),\"\",TEXT(CJ16,\"mmm\"))","v":"Sep"},{"$f":"IF(MONTH(CK16)=MONTH(CJ16),\"\",TEXT(CK16,\"mmm\"))","v":""},{"$f":"IF(MONTH(CL16)=MONTH(CK16),\"\",TEXT(CL16,\"mmm\"))","v":""},{"$f":"IF(MONTH(CM16)=MONTH(CL16),\"\",TEXT(CM16,\"mmm\"))","v":""},{"$f":"IF(MONTH(CN16)=MONTH(CM16),\"\",TEXT(CN16,\"mmm\"))","v":"Oct"},{"$f":"IF(MONTH(CO16)=MONTH(CN16),\"\",TEXT(CO16,\"mmm\"))","v":""},{"$f":"IF(MONTH(CP16)=MONTH(CO16),\"\",TEXT(CP16,\"mmm\"))","v":""},{"$f":"IF(MONTH(CQ16)=MONTH(CP16),\"\",TEXT(CQ16,\"mmm\"))","v":""},{"$f":"IF(MONTH(CR16)=MONTH(CQ16),\"\",TEXT(CR16,\"mmm\"))","v":"Nov"},{"$f":"IF(MONTH(CS16)=MONTH(CR16),\"\",TEXT(CS16,\"mmm\"))","v":""},{"$f":"IF(MONTH(CT16)=MONTH(CS16),\"\",TEXT(CT16,\"mmm\"))","v":""},{"$f":"IF(MONTH(CU16)=MONTH(CT16),\"\",TEXT(CU16,\"mmm\"))","v":""},{"$f":"IF(MONTH(CV16)=MONTH(CU16),\"\",TEXT(CV16,\"mmm\"))","v":""},{"$f":"IF(MONTH(CW16)=MONTH(CV16),\"\",TEXT(CW16,\"mmm\"))","v":"Dec"},{"$f":"IF(MONTH(CX16)=MONTH(CW16),\"\",TEXT(CX16,\"mmm\"))","v":""},{"$f":"IF(MONTH(CY16)=MONTH(CX16),\"\",TEXT(CY16,\"mmm\"))","v":""},{"$f":"IF(MONTH(CZ16)=MONTH(CY16),\"\",TEXT(CZ16,\"mmm\"))","v":""},{"$f":"IF(MONTH(DA16)=MONTH(CZ16),\"\",TEXT(DA16,\"mmm\"))","v":"Jan"},{"$f":"IF(MONTH(DB16)=MONTH(DA16),\"\",TEXT(DB16,\"mmm\"))","v":""},{"$f":"IF(MONTH(DC16)=MONTH(DB16),\"\",TEXT(DC16,\"mmm\"))","v":""},{"$f":"IF(MONTH(DD16)=MONTH(DC16),\"\",TEXT(DD16,\"mmm\"))","v":""},{"$f":"IF(MONTH(DE16)=MONTH(DD16),\"\",TEXT(DE16,\"mmm\"))","v":""},{"$f":"IF(MONTH(DF16)=MONTH(DE16),\"\",TEXT(DF16,\"mmm\"))","v":"Feb"},{"$f":"IF(MONTH(DG16)=MONTH(DF16),\"\",TEXT(DG16,\"mmm\"))","v":""},{"$f":"IF(MONTH(DH16)=MONTH(DG16),\"\",TEXT(DH16,\"mmm\"))","v":""},{"$f":"IF(MONTH(DI16)=MONTH(DH16),\"\",TEXT(DI16,\"mmm\"))","v":""},{"$f":"IF(MONTH(DJ16)=MONTH(DI16),\"\",TEXT(DJ16,\"mmm\"))","v":"Mar"},{"$f":"IF(MONTH(DK16)=MONTH(DJ16),\"\",TEXT(DK16,\"mmm\"))","v":""},{"$f":"IF(MONTH(DL16)=MONTH(DK16),\"\",TEXT(DL16,\"mmm\"))","v":""},{"$f":"IF(MONTH(DM16)=MONTH(DL16),\"\",TEXT(DM16,\"mmm\"))","v":""},{"$f":"IF(MONTH(DN16)=MONTH(DM16),\"\",TEXT(DN16,\"mmm\"))","v":"Apr"},{"$f":"IF(MONTH(DO16)=MONTH(DN16),\"\",TEXT(DO16,\"mmm\"))","v":""},{"$f":"IF(MONTH(DP16)=MONTH(DO16),\"\",TEXT(DP16,\"mmm\"))","v":""},{"$f":"IF(MONTH(DQ16)=MONTH(DP16),\"\",TEXT(DQ16,\"mmm\"))","v":""},{"$f":"IF(MONTH(DR16)=MONTH(DQ16),\"\",TEXT(DR16,\"mmm\"))","v":"May"},{"$f":"IF(MONTH(DS16)=MONTH(DR16),\"\",TEXT(DS16,\"mmm\"))","v":""},{"$f":"IF(MONTH(DT16)=MONTH(DS16),\"\",TEXT(DT16,\"mmm\"))","v":""},{"$f":"IF(MONTH(DU16)=MONTH(DT16),\"\",TEXT(DU16,\"mmm\"))","v":""},{"$f":"IF(MONTH(DV16)=MONTH(DU16),\"\",TEXT(DV16,\"mmm\"))","v":""},{"$f":"IF(MONTH(DW16)=MONTH(DV16),\"\",TEXT(DW16,\"mmm\"))","v":"Jun"},{"$f":"IF(MONTH(DX16)=MONTH(DW16),\"\",TEXT(DX16,\"mmm\"))","v":""},{"$f":"IF(MONTH(DY16)=MONTH(DX16),\"\",TEXT(DY16,\"mmm\"))","v":""},{"$f":"IF(MONTH(DZ16)=MONTH(DY16),\"\",TEXT(DZ16,\"mmm\"))","v":""},{"$f":"IF(MONTH(EA16)=MONTH(DZ16),\"\",TEXT(EA16,\"mmm\"))","v":"Jul"},{"$f":"IF(MONTH(EB16)=MONTH(EA16),\"\",TEXT(EB16,\"mmm\"))","v":""},{"$f":"IF(MONTH(EC16)=MONTH(EB16),\"\",TEXT(EC16,\"mmm\"))","v":""},{"$f":"IF(MONTH(ED16)=MONTH(EC16),\"\",TEXT(ED16,\"mmm\"))","v":""},{"$f":"IF(MONTH(EE16)=MONTH(ED16),\"\",TEXT(EE16,\"mmm\"))","v":"Aug"},{"$f":"IF(MONTH(EF16)=MONTH(EE16),\"\",TEXT(EF16,\"mmm\"))","v":""},{"$f":"IF(MONTH(EG16)=MONTH(EF16),\"\",TEXT(EG16,\"mmm\"))","v":""},{"$f":"IF(MONTH(EH16)=MONTH(EG16),\"\",TEXT(EH16,\"mmm\"))","v":""},{"$f":"IF(MONTH(EI16)=MONTH(EH16),\"\",TEXT(EI16,\"mmm\"))","v":""},{"$f":"IF(MONTH(EJ16)=MONTH(EI16),\"\",TEXT(EJ16,\"mmm\"))","v":"Sep"},{"$f":"IF(MONTH(EK16)=MONTH(EJ16),\"\",TEXT(EK16,\"mmm\"))","v":""},{"$f":"IF(MONTH(EL16)=MONTH(EK16),\"\",TEXT(EL16,\"mmm\"))","v":""},{"$f":"IF(MONTH(EM16)=MONTH(EL16),\"\",TEXT(EM16,\"mmm\"))","v":""},{"$f":"IF(MONTH(EN16)=MONTH(EM16),\"\",TEXT(EN16,\"mmm\"))","v":"Oct"},{"$f":"IF(MONTH(EO16)=MONTH(EN16),\"\",TEXT(EO16,\"mmm\"))","v":""},{"$f":"IF(MONTH(EP16)=MONTH(EO16),\"\",TEXT(EP16,\"mmm\"))","v":""},{"$f":"IF(MONTH(EQ16)=MONTH(EP16),\"\",TEXT(EQ16,\"mmm\"))","v":""},{"$f":"IF(MONTH(ER16)=MONTH(EQ16),\"\",TEXT(ER16,\"mmm\"))","v":""},{"$f":"IF(MONTH(ES16)=MONTH(ER16),\"\",TEXT(ES16,\"mmm\"))","v":"Nov"},{"$f":"IF(MONTH(ET16)=MONTH(ES16),\"\",TEXT(ET16,\"mmm\"))","v":""},{"$f":"IF(MONTH(EU16)=MONTH(ET16),\"\",TEXT(EU16,\"mmm\"))","v":""},{"$f":"IF(MONTH(EV16)=MONTH(EU16),\"\",TEXT(EV16,\"mmm\"))","v":""},{"$f":"IF(MONTH(EW16)=MONTH(EV16),\"\",TEXT(EW16,\"mmm\"))","v":"Dec"},{"$f":"IF(MONTH(EX16)=MONTH(EW16),\"\",TEXT(EX16,\"mmm\"))","v":""},{"$f":"IF(MONTH(EY16)=MONTH(EX16),\"\",TEXT(EY16,\"mmm\"))","v":""},{"$f":"IF(MONTH(EZ16)=MONTH(EY16),\"\",TEXT(EZ16,\"mmm\"))","v":""},{"$f":"IF(MONTH(FA16)=MONTH(EZ16),\"\",TEXT(FA16,\"mmm\"))","v":"Jan"},{"$f":"IF(MONTH(FB16)=MONTH(FA16),\"\",TEXT(FB16,\"mmm\"))","v":""},{"$f":"IF(MONTH(FC16)=MONTH(FB16),\"\",TEXT(FC16,\"mmm\"))","v":""},{"$f":"IF(MONTH(FD16)=MONTH(FC16),\"\",TEXT(FD16,\"mmm\"))","v":""},{"$f":"IF(MONTH(FE16)=MONTH(FD16),\"\",TEXT(FE16,\"mmm\"))","v":""},{"$f":"IF(MONTH(FF16)=MONTH(FE16),\"\",TEXT(FF16,\"mmm\"))","v":"Feb"},{"$f":"IF(MONTH(FG16)=MONTH(FF16),\"\",TEXT(FG16,\"mmm\"))","v":""},{"$f":"IF(MONTH(FH16)=MONTH(FG16),\"\",TEXT(FH16,\"mmm\"))","v":""}]
[null,null,"ID","Task","Start Date","End Date","Contingency\n  Days","End date \n+ \nContingency  ","2024-03-02",{"$f":"I16+7","v":"2024-03-09"},{"$f":"J16+7","v":"2024-03-16"},"2024-03-23","2024-03-30","2024-04-06","2024-04-13","2024-04-20","2024-04-27","2024-05-04","2024-05-11","2024-05-18","2024-05-25","2024-06-01","2024-06-08","2024-06-15","2024-06-22","2024-06-29","2024-07-06","2024-07-13","2024-07-20","2024-07-27","2024-08-03","2024-08-10","2024-08-17","2024-08-24","2024-08-31","2024-09-07","2024-09-14","2024-09-21","2024-09-28","2024-10-05","2024-10-12","2024-10-19","2024-10-26","2024-11-02","2024-11-09","2024-11-16","2024-11-23","2024-11-30","2024-12-07","2024-12-14","2024-12-21","2024-12-28","2025-01-04","2025-01-11","2025-01-18","2025-01-25","2025-02-01","2025-02-08","2025-02-15","2025-02-22","2025-03-01","2025-03-08","2025-03-15","2025-03-22","2025-03-29","2025-04-05","2025-04-12","2025-04-19","2025-04-26","2025-05-03","2025-05-10","2025-05-17","2025-05-24","2025-05-31",{"$f":"BV16+7","v":"2025-06-07"},"2025-06-14","2025-06-21","2025-06-28","2025-07-05","2025-07-12","2025-07-19","2025-07-26","2025-08-02","2025-08-09","2025-08-16","2025-08-23","2025-08-30","2025-09-06","2025-09-13","2025-09-20","2025-09-27","2025-10-04","2025-10-11","2025-10-18","2025-10-25","2025-11-01","2025-11-08","2025-11-15","2025-11-22","2025-11-29","2025-12-06","2025-12-13","2025-12-20","2025-12-27","2026-01-03","2026-01-10","2026-01-17","2026-01-24","2026-01-31","2026-02-07","2026-02-14","2026-02-21","2026-02-28","2026-03-07","2026-03-14","2026-03-21","2026-03-28","2026-04-04","2026-04-11","2026-04-18","2026-04-25","2026-05-02","2026-05-09","2026-05-16","2026-05-23","2026-05-30","2026-06-06","2026-06-13","2026-06-20","2026-06-27","2026-07-04","2026-07-11","2026-07-18","2026-07-25","2026-08-01","2026-08-08","2026-08-15","2026-08-22",{"$f":"EH16+7","v":"2026-08-29"},"2026-09-05","2026-09-12","2026-09-19","2026-09-26","2026-10-03","2026-10-10","2026-10-17","2026-10-24","2026-10-31","2026-11-07","2026-11-14","2026-11-21","2026-11-28","2026-12-05","2026-12-12","2026-12-19","2026-12-26","2027-01-02","2027-01-09","2027-01-16","2027-01-23","2027-01-30","2027-02-06","2027-02-13","2027-02-20"]
[null,null,null,"Project approval",null,null,null,{"$f":"IF(AND(F17<>\"\", G17<>\"\"), F17 + G17, 1)","v":"1900-01-01"}]
[null,null,null,null,null,null,null,{"$f":"IF(AND(F18<>\"\", G18<>\"\"), F18 + G18, 1)","v":"1900-01-01"}]
[null,null,null,null,null,null,null,{"$f":"IF(AND(F19<>\"\", G19<>\"\"), F19 + G19, 1)","v":"1900-01-01"}]
[null,null,null,null,null,null,null,"1900-01-01"]
[null,null,null,null,null,null,null,"1900-01-01"]
[null,null,null,null,null,null,null,"1900-01-01"]
[null,null,null,null,null,null,null,"1900-01-01"]
[null,null,null,null,null,null,null,"1900-01-01"]
[null,null,null,null,null,null,null,"1900-01-01"]
[null,null,null,null,null,null,null,"1900-01-01"]
[null,null,null,null,null,null,null,"1900-01-01"]
[null,null,null,null,null,null,null,"1900-01-01"]
[null,null,null,"Preliminary design complete",null,null,null,"1900-01-01"]
[null,null,null,null,null,null,null,"1900-01-01"]
[null,null,null,null,null,null,null,"1900-01-01"]
[null,null,null,null,null,null,null,"1900-01-01"]
[null,null,null,null,null,null,null,"1900-01-01"]
[null,null,null,null,null,null,null,"1900-01-01"]
[null,null,null,null,null,null,null,"1900-01-01"]
[null,null,null,null,null,null,null,"1900-01-01"]
[null,null,null,null,null,null,null,"1900-01-01"]
[null,null,null,null,null,null,null,"1900-01-01"]
[null,null,null,null,null,null,null,"1900-01-01"]
[null,null,null,null,null,null,null,"1900-01-01"]
[null,null,null,"Final design complete",null,null,null,"1900-01-01"]
[null,null,null,null,null,null,null,"1900-01-01"]
[null,null,null,null,null,null,null,"1900-01-01"]
[null,null,null,null,null,null,null,"1900-01-01"]
[null,null,null,null,null,null,null,"1900-01-01"]
[null,null,null,null,null,null,null,"1900-01-01"]
[null,null,null,null,null,null,null,"1900-01-01"]
[null,null,null,null,null,null,null,"1900-01-01"]
[null,null,null,null,null,null,null,"1900-01-01"]
[null,null,null,null,null,null,null,"1900-01-01"]
[null,null,null,null,null,null,null,"1900-01-01"]
[null,null,null,null,null,null,null,"1900-01-01"]
[null,null,null,"Out to tender",null,null,null,"1900-01-01"]
[null,null,null,null,null,null,null,"1900-01-01"]
[null,null,null,null,null,null,null,"1900-01-01"]
[null,null,null,null,null,null,null,"1900-01-01"]
[null,null,null,null,null,null,null,"1900-01-01"]
[null,null,null,null,null,null,null,"1900-01-01"]
[null,null,null,null,null,null,null,"1900-01-01"]
[null,null,null,null,null,null,null,"1900-01-01"]
[null,null,null,null,null,null,null,"1900-01-01"]
[null,null,null,null,null,null,null,"1900-01-01"]
[null,null,null,"Tenders complete",null,null,null,"1900-01-01"]
[null,null,null,null,null,null,null,"1900-01-01"]
[null,null,null,null,null,null,null,"1900-01-01"]
[null,null,null,null,null,null,null,"1900-01-01"]
[null,null,null,null,null,null,null,"1900-01-01"]
[null,null,null,null,null,null,null,"1900-01-01"]
[null,null,null,null,null,null,null,"1900-01-01"]
[null,null,null,"Orders placed",null,null,null,"1900-01-01"]
[null,null,null,null,null,null,null,"1900-01-01"]
[null,null,null,null,null,null,null,"1900-01-01"]
[null,null,null,null,null,null,null,"1900-01-01"]
[null,null,null,null,null,null,null,"1900-01-01"]
[null,null,null,null,null,null,null,"1900-01-01"]
[null,null,null,null,null,null,null,"1900-01-01"]
[null,null,null,null,null,null,null,"1900-01-01"]
[null,null,null,"Works in progress on site",null,null,null,"1900-01-01"]
[null,null,null,null,null,null,null,"1900-01-01"]
[null,null,null,null,null,null,null,"1900-01-01"]
[null,null,null,null,null,null,null,"1900-01-01"]
[null,null,null,null,null,null,null,"1900-01-01"]
[null,null,null,null,null,null,null,{"$f":"IF(AND(F83<>\"\", G83<>\"\"), F83 + G83, 1)","v":"1900-01-01"}]
[null,null,null,"Completed on site",null,null,null,"1900-01-01"]
[null,null,null,null,null,null,null,"1900-01-01"]
[null,null,null,null,null,null,null,"1900-01-01"]
[null,null,null,null,null,null,null,"1900-01-01"]
[null,null,null,null,null,null,null,"1900-01-01"]
[null,null,null,null,null,null,null,"1900-01-01"]
[null,null,null,"Commissioned & Operational ",null,null,null,"1900-01-01"]
[null,null,null,null,null,null,null,"1900-01-01"]
[null,null,null,null,null,null,null,"1900-01-01"]
[null,null,null,null,null,null,null,"1900-01-01"]
[null,null,null,null,null,null,null,"1900-01-01"]

{"sheet":"Sheet2","index":4,"n_rows":16,"n_cols":6,"rows_kept":16,"cut":false,"hidden":true,"merged":[]}
[]
[]
[]
[]
[]
[null,null,"Project Years ",null,null,"Task Categories "]
[null,null,"1 Year"]
[null,null,"2 Year",null,null,"Project approval"]
[null,null,"3 Year",null,null,"Preliminary design complete"]
[null,null,null,null,null,"Final design complete"]
[null,null,null,null,null,"Out to tender"]
[null,null,null,null,null,"Tenders complete"]
[null,null,"Yes",null,null,"Orders placed"]
[null,null,null,null,null,"Works in progress on site"]
[null,null,null,null,null,"Completed on site"]
[null,null,null,null,null,"Commissioned & Operational "]